Pokaż wyniki od 1 do 15 z 15
Wątek: Blad przy komplikacji
  1. #1
    Zbanowany
    Dołączył
    05 Apr 2010
    Posty
    106
    Reputacja:
    Punkty reputacji: 35
    Podziękował(a)
    0
    Podziękowań 0 w 0 postach

    Blad przy komplikacji

    Witam!
    Mam problem otóż chce skomplikować silnik ale mi wyskakuje ten błąd,proszę o pomoc
    Kod:
    Kompilator: Default compiler
    Building Makefile: "C:\Users\...\Desktop\0.3.6pl1.r83\dev-cpp\Makefile.win"
    Wykonywanie  make...
    make.exe -f "C:\Users\...k\Desktop\0.3.6pl1.r83\dev-cpp\Makefile.win" all
    g++.exe obj//actions.o obj//allocator.o obj//baseevents.o obj//beds.o obj//chat.o obj//combat.o obj//protocolold.o obj//condition.o obj//configmanager.o obj//connection.o obj//container.o obj//creature.o obj//creatureevent.o obj//cylinder.o obj//database.o obj//databasemysql.o obj//databasesqlite.o obj//depot.o obj//exception.o obj//fileloader.o obj//game.o obj//gui.o obj//house.o obj//housetile.o obj//inputbox.o obj//ioguild.o obj//iologindata.o obj//iomap.o obj//iomapserialize.o obj//item.o obj//items.o obj//luascript.o obj//mailbox.o obj//map.o obj//md5.o obj//monster.o obj//monsters.o obj//movement.o obj//networkmessage.o obj//npc.o obj//otserv.o obj//outfit.o obj//outputmessage.o obj//party.o obj//player.o obj//playerbox.o obj//position.o obj//protocol.o obj//protocolgame.o obj//protocollogin.o obj//quests.o obj//raids.o obj//rsa.o obj//scheduler.o obj//scriptmanager.o obj//server.o obj//sha1.o obj//spawn.o obj//spells.o obj//status.o obj//talkaction.o obj//tasks.o obj//teleport.o obj//textlogger.o obj//thing.o obj//tile.o obj//tools.o obj//trashholder.o obj//vocation.o obj//waitlist.o obj//weapons.o obj//ioban.o obj//globalevent.o obj//gameservers.o obj//databasemanager.o obj//admin.o obj//itemattributes.o obj//group.o obj//TheForgottenServer_private.res -o "TheForgottenServer.exe" -L"C:/Dev-Cpp/lib" -mwindows --O1 -lboost_system -lgmp -llua5.1 -lmysql -lsqlite3 -lwsock32 -lxml2 -lmysql -lws2_32 -s libboost_regex.lib  
    
    g++.exe: libboost_regex.lib: No such file or directory
    
    make.exe: *** [TheForgottenServer.exe] Error 1
    
    Wykonanie zakończone

  2. #2
    Rzemieślnik
    Dołączył
    30 Oct 2008
    Posty
    99
    Reputacja:
    Punkty reputacji: 3
    Podziękował(a)
    0
    Podziękowań 0 w 0 postach

    Domyślnie Odp: Blad przy komplikacji

    Nie ma pliku lub katalogu libboost_regex.lib.
    Lub jest zła ścieszka do tego pliku.

  3. #3
    Zbanowany
    Dołączył
    05 Apr 2010
    Posty
    106
    Reputacja:
    Punkty reputacji: 35
    Podziękował(a)
    0
    Podziękowań 0 w 0 postach

    Odp: Blad przy komplikacji

    no zmieniłem na libboost_regex.a.
    leczy teraz mam takie blędy:
    Kod:
    Kompilator: Default compiler
    Building Makefile: "C:\Users\...\Desktop\0.3.6pl1.r83\dev-cpp\Makefile.win"
    Wykonywanie  make...
    make.exe -f "C:\Users\...\Desktop\0.3.6pl1.r83\dev-cpp\Makefile.win" all
    windres.exe -i TheForgottenServer_private.rc --input-format=rc -o obj//TheForgottenServer_private.res -O coff 
    
    g++.exe obj//actions.o obj//allocator.o obj//baseevents.o obj//beds.o obj//chat.o obj//combat.o obj//protocolold.o obj//condition.o obj//configmanager.o obj//connection.o obj//container.o obj//creature.o obj//creatureevent.o obj//cylinder.o obj//database.o obj//databasemysql.o obj//databasesqlite.o obj//depot.o obj//exception.o obj//fileloader.o obj//game.o obj//gui.o obj//house.o obj//housetile.o obj//inputbox.o obj//ioguild.o obj//iologindata.o obj//iomap.o obj//iomapserialize.o obj//item.o obj//items.o obj//luascript.o obj//mailbox.o obj//map.o obj//md5.o obj//monster.o obj//monsters.o obj//movement.o obj//networkmessage.o obj//npc.o obj//otserv.o obj//outfit.o obj//outputmessage.o obj//party.o obj//player.o obj//playerbox.o obj//position.o obj//protocol.o obj//protocolgame.o obj//protocollogin.o obj//quests.o obj//raids.o obj//rsa.o obj//scheduler.o obj//scriptmanager.o obj//server.o obj//sha1.o obj//spawn.o obj//spells.o obj//status.o obj//talkaction.o obj//tasks.o obj//teleport.o obj//textlogger.o obj//thing.o obj//tile.o obj//tools.o obj//trashholder.o obj//vocation.o obj//waitlist.o obj//weapons.o obj//ioban.o obj//globalevent.o obj//gameservers.o obj//databasemanager.o obj//admin.o obj//itemattributes.o obj//group.o obj//TheForgottenServer_private.res -o "TheForgottenServer.exe" -L"C:/Dev-Cpp/lib" -mwindows --O1 -lboost_system -lgmp -llua5.1 -lmysql -lsqlite3 -lwsock32 -lxml2 -lmysql -lws2_32 -s  ../../../../../Dev-Cpp/lib/libboost_regex.a  
    
    obj//connection.o(.text$_ZN5boost6detail17basic_timed_mutex9get_eventEv[__ZN5boost6detail17basic_timed_mutex9get_eventEv]+0xb9):connection.cpp: undefined reference to `boost::thread_resource_error::thread_resource_error()'
    
    obj//connection.o(.text$_ZN5boost6detail17basic_timed_mutex9get_eventEv[__ZN5boost6detail17basic_timed_mutex9get_eventEv]+0xe9):connection.cpp: undefined reference to `boost::thread_resource_error::~thread_resource_error()'
    obj//databasemysql.o(.text+0xfc):databasemysql.cpp: undefined reference to `mysql_init@4'
    obj//databasemysql.o(.text+0x17e):databasemysql.cpp: undefined reference to `mysql_options@12'
    obj//databasemysql.o(.text+0x1c9):databasemysql.cpp: undefined reference to `mysql_options@12'
    obj//databasemysql.o(.text+0x1e6):databasemysql.cpp: undefined reference to `mysql_get_client_version@0'
    obj//databasemysql.o(.text+0xda0):databasemysql.cpp: undefined reference to `mysql_init@4'
    obj//databasemysql.o(.text+0xe22):databasemysql.cpp: undefined reference to `mysql_options@12'
    obj//databasemysql.o(.text+0xe6d):databasemysql.cpp: undefined reference to `mysql_options@12'
    obj//databasemysql.o(.text+0xe8a):databasemysql.cpp: undefined reference to `mysql_get_client_version@0'
    obj//databasemysql.o(.text+0x15cb):databasemysql.cpp: undefined reference to `mysql_rollback@4'
    obj//databasemysql.o(.text+0x15df):databasemysql.cpp: undefined reference to `mysql_errno@4'
    obj//databasemysql.o(.text+0x15ec):databasemysql.cpp: undefined reference to `mysql_error@4'
    obj//databasemysql.o(.text+0x1687):databasemysql.cpp: undefined reference to `mysql_commit@4'
    obj//databasemysql.o(.text+0x169b):databasemysql.cpp: undefined reference to `mysql_errno@4'
    obj//databasemysql.o(.text+0x16a8):databasemysql.cpp: undefined reference to `mysql_error@4'
    obj//databasemysql.o(.text+0x1760):databasemysql.cpp: undefined reference to `mysql_real_query@12'
    obj//databasemysql.o(.text+0x1773):databasemysql.cpp: undefined reference to `mysql_errno@4'
    obj//databasemysql.o(.text+0x17c6):databasemysql.cpp: undefined reference to `mysql_error@4'
    obj//databasemysql.o(.text+0x1851):databasemysql.cpp: undefined reference to `mysql_store_result@4'
    obj//databasemysql.o(.text+0x1860):databasemysql.cpp: undefined reference to `mysql_free_result@4'
    obj//databasemysql.o(.text+0x18ee):databasemysql.cpp: undefined reference to `mysql_real_query@12'
    obj//databasemysql.o(.text+0x1904):databasemysql.cpp: undefined reference to `mysql_errno@4'
    obj//databasemysql.o(.text+0x196f):databasemysql.cpp: undefined reference to `mysql_error@4'
    obj//databasemysql.o(.text+0x1a17):databasemysql.cpp: undefined reference to `mysql_store_result@4'
    obj//databasemysql.o(.text+0x1aa7):databasemysql.cpp: undefined reference to `mysql_errno@4'
    
    obj//databasemysql.o(.text+0x1b12):databasemysql.cpp: undefined reference to `mysql_error@4'
    obj//databasemysql.o(.text+0x1c86):databasemysql.cpp: undefined reference to `mysql_real_escape_string@16'
    obj//databasemysql.o(.text+0x1f65):databasemysql.cpp: undefined reference to `mysql_ping@4'
    obj//databasemysql.o(.text+0x217e):databasemysql.cpp: undefined reference to `mysql_close@4'
    obj//databasemysql.o(.text+0x2227):databasemysql.cpp: undefined reference to `mysql_real_connect@32'
    obj//databasemysql.o(.text+0x2236):databasemysql.cpp: undefined reference to `mysql_errno@4'
    obj//databasemysql.o(.text+0x2243):databasemysql.cpp: undefined reference to `mysql_error@4'
    obj//databasemysql.o(.text+0x2766):databasemysql.cpp: undefined reference to `mysql_fetch_lengths@4'
    obj//databasemysql.o(.text+0x2825):databasemysql.cpp: undefined reference to `mysql_free_result@4'
    obj//databasemysql.o(.text+0x2887):databasemysql.cpp: undefined reference to `mysql_fetch_row@4'
    obj//databasemysql.o(.text+0x2b74):databasemysql.cpp: undefined reference to `mysql_fetch_field@4'
    obj//databasemysql.o(.text$_ZN13DatabaseMySQLD0Ev[__ZN13DatabaseMySQLD0Ev]+0x55):databasemysql.cpp: undefined reference to `mysql_close@4'
    obj//databasemysql.o(.text$_ZN13DatabaseMySQLD1Ev[__ZN13DatabaseMySQLD1Ev]+0x55):databasemysql.cpp: undefined reference to `mysql_close@4'
    obj//databasemysql.o(.text$_ZN13DatabaseMySQL15getLastInsertIdEv[__ZN13DatabaseMySQL15getLastInsertIdEv]+0x10):databasemysql.cpp: undefined reference to `mysql_insert_id@4'
    obj//luascript.o(.text$_ZN5boost10filesystem24basic_directory_iteratorINS0_10basic_pathISsNS0_11path_traitsEEEE9incrementEv[__ZN5boost10filesystem24basic_directory_iteratorINS0_10basic_pathISsNS0_11path_traitsEEEE9incrementEv]+0x190):luascript.cpp: undefined reference to `boost::filesystem::detail::dir_itr_increment(void*&, std::string&, boost::filesystem::file_status&, boost::filesystem::file_status&)'
    obj//luascript.o(.text$_ZN5boost10filesystem6statusERKNS0_10basic_pathISsNS0_11path_traitsEEE[__ZN5boost10filesystem6statusERKNS0_10basic_pathISsNS0_11path_traitsEEE]+0x242):luascript.cpp: undefined reference to `boost::filesystem::detail::status_api(std::string const&, boost::system::error_code&)'
    obj//luascript.o(.text$_ZN5boost10filesystem24basic_directory_iteratorINS0_10basic_pathISsNS0_11path_traitsEEEE6m_initERKS4_[__ZN5boost10filesystem24basic_directory_iteratorINS0_10basic_pathISsNS0_11path_traitsEEEE6m_initERKS4_]+0x140):luascript.cpp: undefined reference to `boost::filesystem::detail::not_found_error()'
    obj//luascript.o(.text$_ZN5boost10filesystem24basic_directory_iteratorINS0_10basic_pathISsNS0_11path_traitsEEEE6m_initERKS4_[__ZN5boost10filesystem24basic_directory_iteratorINS0_10basic_pathISsNS0_11path_traitsEEEE6m_initERKS4_]+0x3a6):luascript.cpp: undefined reference to `boost::filesystem::detail::dir_itr_first(void*&, std::string const&, std::string&, boost::filesystem::file_status&, boost::filesystem::file_status&)'
    obj//luascript.o(.text$_ZN5boost10filesystem6detail11dir_itr_impINS0_10basic_pathISsNS0_11path_traitsEEEED1Ev[__ZN5boost10filesystem6detail11dir_itr_impINS0_10basic_pathISsNS0_11path_traitsEEEED1Ev]+0x52):luascript.cpp: undefined reference to `boost::filesystem::detail::dir_itr_close(void*&)'
    obj//otserv.o(.text+0x7f71):otserv.cpp: undefined reference to `boost::thread::~thread()'
    obj//otserv.o(.text$_ZN5boost6detail24basic_condition_variable7do_waitINS_11unique_lockINS_5mutexEEEEEbRT_NS0_7timeoutE[__ZN5boost6detail24basic_condition_variable7do_waitINS_11unique_lockINS_5mutexEEEEEbRT_NS0_7timeoutE]+0x409):otserv.cpp: undefined reference to `boost::this_thread::interruptible_wait(void*, boost::detail::timeout)'
    obj//otserv.o(.text$_ZN5boost6detail24basic_condition_variable7do_waitINS_11unique_lockINS_5mutexEEEEEbRT_NS0_7timeoutE[__ZN5boost6detail24basic_condition_variable7do_waitINS_11unique_lockINS_5mutexEEEEEbRT_NS0_7timeoutE]+0x783):otserv.cpp: undefined reference to `boost::lock_error::lock_error()'
    obj//otserv.o(.text$_ZN5boost6detail24basic_condition_variable7do_waitINS_11unique_lockINS_5mutexEEEEEbRT_NS0_7timeoutE[__ZN5boost6detail24basic_condition_variable7do_waitINS_11unique_lockINS_5mutexEEEEEbRT_NS0_7timeoutE]+0x85b):otserv.cpp: undefined reference to `boost::lock_error::~lock_error()'
    obj//otserv.o(.text$_ZN5boost6detail24basic_condition_variable7do_waitINS_11unique_lockINS_5mutexEEEEEbRT_NS0_7timeoutE[__ZN5boost6detail24basic_condition_variable7do_waitINS_11unique_lockINS_5mutexEEEEEbRT_NS0_7timeoutE]+0xcd8):otserv.cpp: undefined reference to `boost::lock_error::lock_error()'
    obj//otserv.o(.text$_ZN5boost6detail24basic_condition_variable7do_waitINS_11unique_lockINS_5mutexEEEEEbRT_NS0_7timeoutE[__ZN5boost6detail24basic_condition_variable7do_waitINS_11unique_lockINS_5mutexEEEEEbRT_NS0_7timeoutE]+0xd08):otserv.cpp: undefined reference to `boost::lock_error::~lock_error()'
    obj//otserv.o(.text$_ZN5boost6detail24basic_condition_variable7do_waitINS_11unique_lockINS_5mutexEEEEEbRT_NS0_7timeoutE[__ZN5boost6detail24basic_condition_variable7do_waitINS_11unique_lockINS_5mutexEEEEEbRT_NS0_7timeoutE]+0x113a):otserv.cpp: undefined reference to `boost::lock_error::lock_error()'
    obj//otserv.o(.text$_ZN5boost6detail24basic_condition_variable7do_waitINS_11unique_lockINS_5mutexEEEEEbRT_NS0_7timeoutE[__ZN5boost6detail24basic_condition_variable7do_waitINS_11unique_lockINS_5mutexEEEEEbRT_NS0_7timeoutE]+0x116a):otserv.cpp: undefined reference to `boost::lock_error::~lock_error()'
    obj//otserv.o(.text$_ZN5boost6detail24basic_condition_variable14get_wait_entryEv[__ZN5boost6detail24basic_condition_variable14get_wait_entryEv]+0xf6):otserv.cpp: undefined reference to `boost::thread_resource_error::thread_resource_error()'
    obj//otserv.o(.text$_ZN5boost6detail24basic_condition_variable14get_wait_entryEv[__ZN5boost6detail24basic_condition_variable14get_wait_entryEv]+0x113):otserv.cpp: undefined reference to `boost::thread_resource_error::~thread_resource_error()'
    obj//otserv.o(.text$_ZN5boost6detail24basic_condition_variable14get_wait_entryEv[__ZN5boost6detail24basic_condition_variable14get_wait_entryEv]+0x2b2):otserv.cpp: undefined reference to `boost::thread_resource_error::thread_resource_error()'
    obj//otserv.o(.text$_ZN5boost6detail24basic_condition_variable14get_wait_entryEv[__ZN5boost6detail24basic_condition_variable14get_wait_entryEv]+0x2cf):otserv.cpp: undefined reference to `boost::thread_resource_error::~thread_resource_error()'
    obj//otserv.o(.text$_ZN5boost6detail24basic_condition_variable14get_wait_entryEv[__ZN5boost6detail24basic_condition_variable14get_wait_entryEv]+0x388):otserv.cpp: undefined reference to `boost::thread_resource_error::thread_resource_error()'
    obj//otserv.o(.text$_ZN5boost6detail24basic_condition_variable14get_wait_entryEv[__ZN5boost6detail24basic_condition_variable14get_wait_entryEv]+0x3a2):otserv.cpp: undefined reference to `boost::thread_resource_error::~thread_resource_error()'
    obj//otserv.o(.text$_ZN5boost6threadC1INS_3_bi6bind_tIvPFvPvENS2_5list1INS2_5valueIS4_EEEEEEEET_NS_10disable_ifINS_14is_convertibleIRSC_NS_6detail13thread_move_tISC_EEEEPNS0_5dummyEE4typeE[__ZN5boost6threadC1INS_3_bi6bind_tIvPFvPvENS2_5list1INS2_5valueIS4_EEEEEEEET_NS_10disable_ifINS_14is_convertibleIRSC_NS_6detail13thread_move_tISC_EEEEPNS0_5dummyEE4typeE]+0x182):otserv.cpp: undefined reference to `boost::thread::start_thread()'
    obj//otserv.o(.text$_ZN5boost6detail24basic_condition_variable8relockerINS_11unique_lockINS_5mutexEEEE6unlockEv[__ZN5boost6detail24basic_condition_variable8relockerINS_11unique_lockINS_5mutexEEEE6unlockEv]+0x60):otserv.cpp: undefined reference to `boost::lock_error::lock_error()'
    obj//otserv.o(.text$_ZN5boost6detail24basic_condition_variable8relockerINS_11unique_lockINS_5mutexEEEE6unlockEv[__ZN5boost6detail24basic_condition_variable8relockerINS_11unique_lockINS_5mutexEEEE6unlockEv]+0x90):otserv.cpp: undefined reference to `boost::lock_error::~lock_error()'
    
    obj//otserv.o(.text$_ZN5boost6detail11thread_dataINS_3_bi6bind_tIvPFvPvENS2_5list1INS2_5valueIS4_EEEEEEEC1ESB_[__ZN5boost6detail11thread_dataINS_3_bi6bind_tIvPFvPvENS2_5list1INS2_5valueIS4_EEEEEEEC1ESB_]+0xb8):otserv.cpp: undefined reference to `boost::thread_resource_error::thread_resource_error()'
    obj//otserv.o(.text$_ZN5boost6detail11thread_dataINS_3_bi6bind_tIvPFvPvENS2_5list1INS2_5valueIS4_EEEEEEEC1ESB_[__ZN5boost6detail11thread_dataINS_3_bi6bind_tIvPFvPvENS2_5list1INS2_5valueIS4_EEEEEEEC1ESB_]+0xde):otserv.cpp: undefined reference to `boost::thread_resource_error::~thread_resource_error()'
    obj//scheduler.o(.text+0x3dd):scheduler.cpp: undefined reference to `boost::thread::~thread()'
    obj//scheduler.o(.text+0xa25):scheduler.cpp: undefined reference to `boost::thread::~thread()'
    obj//scheduler.o(.text+0xdf4):scheduler.cpp: undefined reference to `boost::lock_error::lock_error()'
    obj//scheduler.o(.text+0xe2d):scheduler.cpp: undefined reference to `boost::lock_error::~lock_error()'
    obj//scheduler.o(.text$_ZN5boost11unique_lockINS_5mutexEE6unlockEv[__ZN5boost11unique_lockINS_5mutexEE6unlockEv]+0x5b):scheduler.cpp: undefined reference to `boost::lock_error::lock_error()'
    obj//scheduler.o(.text$_ZN5boost11unique_lockINS_5mutexEE6unlockEv[__ZN5boost11unique_lockINS_5mutexEE6unlockEv]+0x8b):scheduler.cpp: undefined reference to `boost::lock_error::~lock_error()'
    obj//scriptmanager.o(.text$_ZN5boost10filesystem6existsERKNS0_10basic_pathISsNS0_11path_traitsEEE[__ZN5boost10filesystem6existsERKNS0_10basic_pathISsNS0_11path_traitsEEE]+0x242):scriptmanager.cpp: undefined reference to `boost::filesystem::detail::status_api(std::string const&, boost::system::error_code&)'
    
    obj//tasks.o(.text+0x239):tasks.cpp: undefined reference to `boost::thread::~thread()'
    obj//tasks.o(.text+0x5e3):tasks.cpp: undefined reference to `boost::thread::~thread()'
    
    obj//tasks.o(.text+0x874):tasks.cpp: undefined reference to `boost::lock_error::lock_error()'
    obj//tasks.o(.text+0x8ad):tasks.cpp: undefined reference to `boost::lock_error::~lock_error()'
    
    make.exe: *** [TheForgottenServer.exe] Error 1
    
    Wykonanie zakończone

  4. #4
    Rzemieślnik
    Dołączył
    30 Oct 2008
    Posty
    99
    Reputacja:
    Punkty reputacji: 3
    Podziękował(a)
    0
    Podziękowań 0 w 0 postach

    Domyślnie Odp: Blad przy komplikacji

    Spróbuj znaleźć biblioteke libboost_regex.lib, Ponieważ tej co teraz użyłeś, "nie wykrywa/czyta" tych komend z datebase,taks i otserv.

    Oczywiscię jeżeli dobrze zrozumiałem ten błąd

    Kod PHP:
    1. undefined reference to

  5. #5
    Zbanowany
    Dołączył
    05 Apr 2010
    Posty
    106
    Reputacja:
    Punkty reputacji: 35
    Podziękował(a)
    0
    Podziękowań 0 w 0 postach

    Odp: Blad przy komplikacji

    coś pokombinowałem i teraz to wyskoczyło
    Kod:
    Compiler: Default compiler
    Building Makefile: "C:\Users\Marek\Desktop\Makefile.win"
    Executing  make...
    make.exe -f "C:\Users\Marek\Desktop\Makefile.win" all
    g++.exe -c 0.3.6pl1.r83/actions.cpp -o 0.3.6pl1.r83/actions.o -I"C:/Dev-Cpp/lib/gcc/mingw32/3.4.2/include"  -I"C:/Dev-Cpp/include/c++/3.4.2/backward"  -I"C:/Dev-Cpp/include/c++/3.4.2/mingw32"  -I"C:/Dev-Cpp/include/c++/3.4.2"  -I"C:/Dev-Cpp/include"  -D__USE_SQLITE__ -D__USE_MYSQL__ -D__ENABLE_SERVER__ -D__CONSOLE__  
    
    In file included from C:/Dev-Cpp/include/boost/unordered_set.hpp:16,
                     from C:/Dev-Cpp/include/boost/tr1/unordered_set.hpp:21,
    
                     from 0.3.6pl1.r83/house.h:23,
    
                     from 0.3.6pl1.r83/actions.cpp:36:
    C:/Dev-Cpp/include/boost/unordered/unordered_set.hpp:137: error: expected `)' before '<' token
    C:/Dev-Cpp/include/boost/unordered/unordered_set.hpp:146: error: declaration of `operator=' as non-function
    C:/Dev-Cpp/include/boost/unordered/unordered_set.hpp:146: error: expected `;' before '(' token
    C:/Dev-Cpp/include/boost/unordered/unordered_set.hpp:154: error: expected `;' before "private"
    
    C:/Dev-Cpp/include/boost/unordered/unordered_set.hpp:515: error: expected `)' before '<' token
    
    C:/Dev-Cpp/include/boost/unordered/unordered_set.hpp:524: error: declaration of `operator=' as non-function
    C:/Dev-Cpp/include/boost/unordered/unordered_set.hpp:524: error: expected `;' before '(' token
    C:/Dev-Cpp/include/boost/unordered/unordered_set.hpp:532: error: expected `;' before "private"
    
    make.exe: *** [0.3.6pl1.r83/actions.o] Error 1
    
    Execution terminated
    Ostatnio edytowane przez Dyop ; 17-10-10 o 13:10

  6. #6
    Zbanowany
    Dołączył
    05 Apr 2010
    Posty
    106
    Reputacja:
    Punkty reputacji: 35
    Podziękował(a)
    0
    Podziękowań 0 w 0 postach

    Odp: Blad przy komplikacji

    ~~~~odświeżam~~~~~~~~~~!!!!!!!

  7. #7
    Przewodniczący Awatar dominikms1
    Dołączył
    06 Feb 2010
    Posty
    697
    Reputacja:
    Punkty reputacji: 148
    Podziękował(a)
    5
    Podziękowań: 1 w 1 poście

    Domyślnie Odp: Blad przy komplikacji

    The Forgotten Dev-Cpp v2.6!

    Ja używam tego kompilatora i mi działa, sprawdź go.

  8. #8
    Zbanowany
    Dołączył
    05 Apr 2010
    Posty
    106
    Reputacja:
    Punkty reputacji: 35
    Podziękował(a)
    0
    Podziękowań 0 w 0 postach

    Odp: Blad przy komplikacji

    a instalowałeśjakieś paczki?
    i daj swoje parametry

  9. #9
    Przewodniczący Awatar dominikms1
    Dołączył
    06 Feb 2010
    Posty
    697
    Reputacja:
    Punkty reputacji: 148
    Podziękował(a)
    5
    Podziękowań: 1 w 1 poście

    Domyślnie Odp: Blad przy komplikacji

    Tam są gotowe paczki, nic nie trzeba instalować.

    Wypakuj to najlepiej na dysku c, usuń swojego starego Kompilatora, wejdz w pliki źródłowe twojego otsa, daj prawym na swój plik *.dev, uruchom jako..., wybierz nowego kompilatora.
    I przebuduj :)

  10. #10
    Zbanowany
    Dołączył
    05 Apr 2010
    Posty
    106
    Reputacja:
    Punkty reputacji: 35
    Podziękował(a)
    0
    Podziękowań 0 w 0 postach

    Odp: Blad przy komplikacji

    Coś mi nieidzie... wyskakują znowu błędy a mógłby ktośdac tfs 0.3.6pl1 skomplikowany na Linuxa?pod tibie 8.54-8.57?
    rep+

  11. #11
    Zbanowany
    Dołączył
    05 Apr 2010
    Posty
    106
    Reputacja:
    Punkty reputacji: 35
    Podziękował(a)
    0
    Podziękowań 0 w 0 postach

    Odp: Blad przy komplikacji

    Odświeżam odpiszcie!

  12. #12
    Zbanowany
    Dołączył
    05 Apr 2010
    Posty
    106
    Reputacja:
    Punkty reputacji: 35
    Podziękował(a)
    0
    Podziękowań 0 w 0 postach

    Odp: Blad przy komplikacji

    Widze, że raczej nikt nieda to niech chociaż pomoże z tymi błędami:
    Kod:
    Compiler: Default compiler
    Building Makefile: "E:\Gry i inne\OTS\PHP\The Forgotten Server 0.3.6pl1 sources\dev-cpp\Makefile.win"
    Executing  make...
    make.exe -f "E:\Gry i inne\OTS\PHP\The Forgotten Server 0.3.6pl1 sources\dev-cpp\Makefile.win" all
    g++.exe -c ../actions.cpp -o obj//actions.o -I"include"  -D__USE_MYSQL__ -D__USE_SQLITE__ -D__ENABLE_SERVER_DIAGNOSTIC__   -fexpensive-optimizations -O1
    
    ../actions.cpp: In member function `ReturnValue Actions::internalUseItem(Player*, const Position&, uint8_t, Item*, uint32_t)':
    
    ../actions.cpp:414: error: invalid use of undefined type `struct Door'
    ../item.h:43: error: forward declaration of `struct Door'
    
    make.exe: *** [obj//actions.o] Error 1
    
    Execution terminated
    Ostatnio edytowane przez Dyop ; 23-10-10 o 09:10

  13. #13
    Zbanowany
    Dołączył
    05 Apr 2010
    Posty
    106
    Reputacja:
    Punkty reputacji: 35
    Podziękował(a)
    0
    Podziękowań 0 w 0 postach

    Odp: Blad przy komplikacji

    Refresh~~czekam na odpowiedzi

  14. #14
    Zbanowany
    Dołączył
    05 Apr 2010
    Posty
    106
    Reputacja:
    Punkty reputacji: 35
    Podziękował(a)
    0
    Podziękowań 0 w 0 postach

    Odp: Blad przy komplikacji

    Odświeżam!!!!!!!!!!!!!!!!!!!!!!

  15. #15
    Zbanowany
    Dołączył
    05 Apr 2010
    Posty
    106
    Reputacja:
    Punkty reputacji: 35
    Podziękował(a)
    0
    Podziękowań 0 w 0 postach

    Odp: Blad przy komplikacji

    Problem rozwiązany,proszę o zamknięcie tematu

Informacje o wątku

Użytkownicy przeglądający ten wątek

Aktualnie 1 użytkownik(ów) przegląda ten wątek. (0 zarejestrowany(ch) oraz 1 gości)

Podobne wątki

  1. TFS Błąd przy komplikacji 0.4 i PAY
    Przez Panek1991 w dziale Stare tematy
    Odpowiedzi: 2
    Ostatni post / autor: 17-09-10, 20:09
  2. BLAD PRZY UPADE 8.5 na 8.54
    Przez God manio w dziale Stare tematy
    Odpowiedzi: 0
    Ostatni post / autor: 01-09-10, 01:09
  3. Blad przy logowaniu
    Przez badmother w dziale Stare tematy
    Odpowiedzi: 2
    Ostatni post / autor: 07-03-10, 13:03
  4. Bledy przy komplikacji POMOCY
    Przez kuba1985 w dziale Stare tematy
    Odpowiedzi: 2
    Ostatni post / autor: 17-01-10, 12:01
  5. blad przy kompilacji
    Przez mitro w dziale Stare tematy
    Odpowiedzi: 0
    Ostatni post / autor: 05-08-09, 13:08

Uprawnienia umieszczania postów

  • Nie możesz zakładać nowych tematów
  • Nie możesz pisać wiadomości
  • Nie możesz dodawać załączników
  • Nie możesz edytować swoich postów
  •